Target
Apoptotic protease-activating factor 1
Ligand
BDBM61233
Substrate
Meas. Tech.
Dose response confirmation of uHTS hits for Apaf-1 in a Fluorescent assay
IC50
2080±n/a nM
Citation
 PubChem, PC Dose response confirmation of uHTS hits for Apaf-1 in a Fluorescent assay PubChem Bioassay (2011)[AID] 
Target
Name:
Apoptotic protease-activating factor 1
Synonyms:
APAF1 Apoptotic peptidase activating factor 1 | KIAA0413
Type:
Enzyme Catalytic Domain
Mol. Mass.:
141834.40
Organism:
Homo sapiens (Human)
Description:
O14727
Residue:
1248
  
Inhibitor
Name:
BDBM61233
Synonyms:
4-[(3,4-diketo-1-naphthyl)amino]benzenesulfonamide 4-[(3,4-dioxo-3,4-dihydro-1-naphthalenyl)amino]benzenesulfonamide 4-[[3,4-bis(oxidanylidene)naphthalen-1-yl]amino]benzenesulfonamide SMR000496650 | cid_367783
Type:
Small organic molecule
Emp. Form.:
C16H12N2O4S
Mol. Mass.:
328.342
SMILES:
NS(=O)(=O)c1ccc(NC2=CC(=O)C(=O)c3ccccc23)cc1
: