Target
Apoptotic protease-activating factor 1
Ligand
BDBM50099737
Substrate
Meas. Tech.
Dose Response validation of Inhibitors of Apaf-1 using a Fluorescent Interference Counterscreen assay
IC50
>100000±0 nM
Citation
 PubChem, PC Dose Response validation of Inhibitors of Apaf-1 using a Fluorescent Interference Counterscreen assay PubChem Bioassay (2011)[AID] 
Target
Name:
Apoptotic protease-activating factor 1
Synonyms:
APAF1 Apoptotic peptidase activating factor 1 | KIAA0413
Type:
Enzyme Catalytic Domain
Mol. Mass.:
141834.40
Organism:
Homo sapiens (Human)
Description:
O14727
Residue:
1248
  
Inhibitor
Name:
BDBM50099737
Synonyms:
2-Amino-phenanthrene-9,10-dione US9073941, 902 | cid_254021
Type:
Small organic molecule
Emp. Form.:
C14H9NO2
Mol. Mass.:
223.2268
SMILES:
Nc1ccc-2c(c1)C(=O)C(=O)c1ccccc-21
: