Target
Apoptotic protease-activating factor 1
Ligand
BDBM51905
Substrate
Meas. Tech.
Dose Response validation of Inhibitors of Apaf-1 using a Fluorescent Interference Counterscreen assay
IC50
>100000±0 nM
Citation
 PubChem, PC Dose Response validation of Inhibitors of Apaf-1 using a Fluorescent Interference Counterscreen assay PubChem Bioassay (2011)[AID] 
Target
Name:
Apoptotic protease-activating factor 1
Synonyms:
APAF1 Apoptotic peptidase activating factor 1 | KIAA0413
Type:
Enzyme Catalytic Domain
Mol. Mass.:
141834.40
Organism:
Homo sapiens (Human)
Description:
O14727
Residue:
1248
  
Inhibitor
Name:
BDBM51905
Synonyms:
1-Decyloxycarbonylmethyl-3-methyl-2-p-tolyloxymethyl-3H-benzoimidazol-1-ium 2-[3-methyl-2-[(4-methylphenoxy)methyl]benzimidazol-3-ium-1-yl]acetic acid decyl ester;chloride SMR000505013 decyl 2-[3-methyl-2-[(4-methylphenoxy)methyl]benzimidazol-3-ium-1-yl]acetate;chloride | decyl 2-[3-methyl-2-[(4-methylphenoxy)methyl]benzimidazol-3-ium-1-yl]ethanoate;chloride
Type:
Small organic molecule
Emp. Form.:
C28H39N2O3
Mol. Mass.:
451.6203
SMILES:
CCCCCCCCCCOC(=O)Cn1c(COc2ccc(C)cc2)[n+](C)c2ccccc12
: