Target
Apoptotic protease-activating factor 1
Ligand
BDBM71380
Substrate
Meas. Tech.
Dose Response validation of Inhibitors of Apaf-1 using a Fluorescent Interference Counterscreen assay
IC50
>100000±0 nM
Citation
 PubChem, PC Dose Response validation of Inhibitors of Apaf-1 using a Fluorescent Interference Counterscreen assay PubChem Bioassay (2011)[AID] 
Target
Name:
Apoptotic protease-activating factor 1
Synonyms:
APAF1 Apoptotic peptidase activating factor 1 | KIAA0413
Type:
Enzyme Catalytic Domain
Mol. Mass.:
141834.40
Organism:
Homo sapiens (Human)
Description:
O14727
Residue:
1248
  
Inhibitor
Name:
BDBM71380
Synonyms:
2,4-dihydroxy-N'-[(E)-(3-methyl-5-oxo-1-phenyl-4-pyrazolylidene)methyl]benzohydrazide 2,4-dihydroxy-N'-[(E)-(5-keto-3-methyl-1-phenyl-2-pyrazolin-4-ylidene)methyl]benzohydrazide N'-[(E)-(3-methyl-5-oxidanylidene-1-phenyl-pyrazol-4-ylidene)methyl]-2,4-bis(oxidanyl)benzohydrazide cid_24761144
Type:
Small organic molecule
Emp. Form.:
C18H16N4O4
Mol. Mass.:
352.344
SMILES:
Cc1[nH]n(-c2ccccc2)c(=O)c1C=NNC(=O)c1ccc(O)cc1O
: