Target
Apoptotic protease-activating factor 1
Ligand
BDBM50713
Substrate
Meas. Tech.
Dose Response confirmation of uHTS Activators of the Apaf-1 Pathway in Fluorescent format
EC50
1240±n/a nM
Citation
 PubChem, PC Dose Response confirmation of uHTS Activators of the Apaf-1 Pathway in Fluorescent format PubChem Bioassay (2011)[AID] 
Target
Name:
Apoptotic protease-activating factor 1
Synonyms:
APAF1 Apoptotic peptidase activating factor 1 | KIAA0413
Type:
Enzyme Catalytic Domain
Mol. Mass.:
141834.40
Organism:
Homo sapiens (Human)
Description:
O14727
Residue:
1248
  
Inhibitor
Name:
BDBM50713
Synonyms:
(8S)-3-(3-methacrylamidophenyl)-7-methacryloyl-1-oxa-2,7-diazaspiro[4.4]non-2-ene-8-carboxamide (8S)-7-(2-methylprop-2-enoyl)-3-[3-(2-methylprop-2-enoylamino)phenyl]-1-oxa-2,7-diazaspiro[4.4]non-2-ene-8-carboxamide SMR000390641 | cid_16745469
Type:
Small organic molecule
Emp. Form.:
C21H24N4O4
Mol. Mass.:
396.4397
SMILES:
CC(=C)C(=O)Nc1cccc(c1)C1=NOC2(C[C@H](N(C2)C(=O)C(C)=C)C(N)=O)C1
: