Target
Caspase-9
Ligand
BDBM34635
Substrate
Meas. Tech.
Dose response confirmation of uHTS hits for Apaf-1 using a LZ-Caspase-9/Caspase-3 Fluorescent Selectivity assay
IC50
2910±n/a nM
Citation
 PubChem, PC Dose response confirmation of uHTS hits for Apaf-1 using a LZ-Caspase-9/Caspase-3 Fluorescent Selectivity assay PubChem Bioassay (2011)[AID] 
Target
Name:
Caspase-9
Synonyms:
Apoptotic protease-activating factor 1/Caspase-3/Caspase-9/Cytochrome c CASP-9 CASP9_HUMAN ICE-like apoptotic protease 6 caspase-9 isoform alpha preproprotein
Type:
Enzyme
Mol. Mass.:
46277.29
Organism:
Homo sapiens (Human)
Description:
Residue:
416
  
Inhibitor
Name:
BDBM34635
Synonyms:
MLS000107482 N-[4-(butylamino)-6,7-dimethoxy-2-naphthyl]acetamide N-[4-(butylamino)-6,7-dimethoxynaphthalen-2-yl]acetamide cid_2253328
Type:
Small organic molecule
Emp. Form.:
C18H24N2O3
Mol. Mass.:
316.3948
SMILES:
CCCCNc1cc(NC(C)=O)cc2cc(OC)c(OC)cc12
: