Target
Caspase-9
Ligand
BDBM40726
Substrate
Meas. Tech.
Dose response confirmation of uHTS hits for Apaf-1 using a LZ-Caspase-9/Caspase-3 Fluorescent Selectivity assay
IC50
1940±n/a nM
Citation
 PubChem, PC Dose response confirmation of uHTS hits for Apaf-1 using a LZ-Caspase-9/Caspase-3 Fluorescent Selectivity assay PubChem Bioassay (2011)[AID] 
Target
Name:
Caspase-9
Synonyms:
Apoptotic protease-activating factor 1/Caspase-3/Caspase-9/Cytochrome c CASP-9 CASP9_HUMAN ICE-like apoptotic protease 6 caspase-9 isoform alpha preproprotein
Type:
Enzyme
Mol. Mass.:
46277.29
Organism:
Homo sapiens (Human)
Description:
Residue:
416
  
Inhibitor
Name:
BDBM40726
Synonyms:
(6-bromopiazthiol-5-yl)amine 5-bromo-2,1,3-benzothiadiazol-6-amine MLS000556153 cid_3096032
Type:
Small organic molecule
Emp. Form.:
C6H4BrN3S
Mol. Mass.:
230.085
SMILES:
Nc1cc2nsnc2cc1Br
: