Target
Caspase-9
Ligand
BDBM61198
Substrate
Meas. Tech.
Dose response confirmation of uHTS hits for Apaf-1 using a LZ-Caspase-9/Caspase-3 Fluorescent Selectivity assay
IC50
2630±n/a nM
Citation
 PubChem, PC Dose response confirmation of uHTS hits for Apaf-1 using a LZ-Caspase-9/Caspase-3 Fluorescent Selectivity assay PubChem Bioassay (2011)[AID] 
Target
Name:
Caspase-9
Synonyms:
Apoptotic protease-activating factor 1/Caspase-3/Caspase-9/Cytochrome c CASP-9 CASP9_HUMAN ICE-like apoptotic protease 6 caspase-9 isoform alpha preproprotein
Type:
Enzyme
Mol. Mass.:
46277.29
Organism:
Homo sapiens (Human)
Description:
Residue:
416
  
Inhibitor
Name:
BDBM61198
Synonyms:
2-methoxybenzaldehyde [2,6-bis(dimethylamino)pyrimidin-4-yl]hydrazone MLS000720211 N6-[(2-methoxyphenyl)methylideneamino]-N2,N2,N4,N4-tetramethylpyrimidine-2,4,6-triamine [2-(dimethylamino)-6-(N'-o-anisylidenehydrazino)pyrimidin-4-yl]-dimethyl-amine | cid_4035805
Type:
Small organic molecule
Emp. Form.:
C16H22N6O
Mol. Mass.:
314.3855
SMILES:
COc1ccccc1CN=Nc1cc(nc(n1)N(C)C)N(C)C
: