Target
Caspase-9
Ligand
BDBM83922
Substrate
Meas. Tech.
Dose response confirmation of uHTS hits for Apaf-1 using a LZ-Caspase-9/Caspase-3 Fluorescent Selectivity assay
IC50
11200±n/a nM
Citation
 PubChem, PC Dose response confirmation of uHTS hits for Apaf-1 using a LZ-Caspase-9/Caspase-3 Fluorescent Selectivity assay PubChem Bioassay (2011)[AID] 
Target
Name:
Caspase-9
Synonyms:
Apoptotic protease-activating factor 1/Caspase-3/Caspase-9/Cytochrome c CASP-9 CASP9_HUMAN ICE-like apoptotic protease 6 caspase-9 isoform alpha preproprotein
Type:
Enzyme
Mol. Mass.:
46277.29
Organism:
Homo sapiens (Human)
Description:
Residue:
416
  
Inhibitor
Name:
BDBM83922
Synonyms:
1,6,6-trimethyl-8,9-dihydro-7H-naphtho[1,2-g][1]benzofuran-10,11-dione 1,6,6-trimethyl-8,9-dihydro-7H-naphtho[1,2-g]benzofuran-10,11-quinone SMR000387068 cid_164676 | med.21724, Compound 173
Type:
Small organic molecule
Emp. Form.:
C19H18O3
Mol. Mass.:
294.3444
SMILES:
Cc1coc-2c1C(=O)C(=O)c1c3CCCC(C)(C)c3ccc-21
: