Target
Protein kinase C delta type
Ligand
BDBM3153
Substrate
Lysine-rich histone
Meas. Tech.
PKC assay
IC50
0.9±n/a nM
Citation
 Lai, YSMenaldino, DSNichols, JBJagdmann , GEMylott, FGillespie, JHall, SE Ring Size effect in the PKC inhibitory activities of perhydroazepine analogs of balanol. Bioorg Med Chem Lett 5:2151-4 (1995)    Article 
Target
Name:
Protein kinase C delta type
Synonyms:
KPCD_HUMAN PKCD Protein Kinase C- delta nPKC-delta
Type:
Enzyme
Mol. Mass.:
77516.79
Organism:
Homo sapiens (Human)
Description:
The recombinant human PKC enzymes were produced using a baculovirus expression system in SF9 cells
Residue:
676
  
Inhibitor
Name:
BDBM3153
Synonyms:
2-{[2,6-dihydroxy-4-({[(1R,2R)-2-[(4-hydroxybenzene)amido]cyclopentyl]oxy}carbonyl)phenyl]carbonyl}-3-hydroxybenzoic acid CHEMBL52529
Type:
Small organic molecule
Emp. Form.:
C27H23NO10
Mol. Mass.:
521.4722
SMILES:
OC(=O)c1cccc(O)c1C(=O)c1c(O)cc(cc1O)C(=O)O[C@@H]1CCC[C@H]1NC(=O)c1ccc(O)cc1
:
Substrate
Name:
Lysine-rich histone
Synonyms:
ING Peptide histone type IIIS
Type:
Peptide
Mol. Mass.:
10508.21
Organism:
Bos taurus (bovine)
Description:
Purified as a lysine rich fraction of histone H1 from calf thymus.
Residue:
105