Target
Apoptotic protease-activating factor 1
Ligand
BDBM35433
Substrate
Meas. Tech.
Dose Response validation of Activators of Apaf-1 using a Fluorescent Interference Counterscreen assay
EC50
13700±22100 nM
Citation
 PubChem, PC Dose Response validation of Activators of Apaf-1 using a Fluorescent Interference Counterscreen assay PubChem Bioassay (2011)[AID] 
Target
Name:
Apoptotic protease-activating factor 1
Synonyms:
APAF1 Apoptotic peptidase activating factor 1 | KIAA0413
Type:
Enzyme Catalytic Domain
Mol. Mass.:
141834.40
Organism:
Homo sapiens (Human)
Description:
O14727
Residue:
1248
  
Inhibitor
Name:
BDBM35433
Synonyms:
MLS000106837 cid_672470
Type:
Small organic molecule
Emp. Form.:
C16H11NO3
Mol. Mass.:
265.2634
SMILES:
CCOc1ccc2noc3-c4ccccc4C(=O)c1c23
: