Target
Apoptotic protease-activating factor 1
Ligand
BDBM46237
Substrate
Meas. Tech.
Dose Response validation of Activators of Apaf-1 using a Fluorescent Interference Counterscreen assay
EC50
>100000±0 nM
Citation
 PubChem, PC Dose Response validation of Activators of Apaf-1 using a Fluorescent Interference Counterscreen assay PubChem Bioassay (2011)[AID] 
Target
Name:
Apoptotic protease-activating factor 1
Synonyms:
APAF1 Apoptotic peptidase activating factor 1 | KIAA0413
Type:
Enzyme Catalytic Domain
Mol. Mass.:
141834.40
Organism:
Homo sapiens (Human)
Description:
O14727
Residue:
1248
  
Inhibitor
Name:
BDBM46237
Synonyms:
4-[3-[(5Z)-4-keto-2-thioxo-5-veratrylidene-thiazolidin-3-yl]propanoylamino]benzoic acid 4-[3-[(5Z)-5-[(3,4-dimethoxyphenyl)methylidene]-4-oxo-2-sulfanylidene-1,3-thiazolidin-3-yl]propanoylamino]benzoic acid MLS-0329775.0001 | cid_1587127
Type:
Small organic molecule
Emp. Form.:
C22H20N2O6S2
Mol. Mass.:
472.534
SMILES:
COc1ccc(\C=C2/SC(=S)N(CCC(=O)Nc3ccc(cc3)C(O)=O)C2=O)cc1OC
: