Target
Sentrin-specific protease 8
Ligand
BDBM84025
Substrate
Meas. Tech.
SAR Analysis of small molecule inhibitors of Sentrin-specific protease 8 (SENP8) using a Luminescent assay - Set 2
IC50
9920±n/a nM
Citation
 PubChem, PC SAR Analysis of small molecule inhibitors of Sentrin-specific protease 8 (SENP8) using a Luminescent assay - Set 2 PubChem Bioassay (2011)[AID] 
Target
Name:
Sentrin-specific protease 8
Synonyms:
DEN1 PRSC2 SENP8_HUMAN | SUMO/sentrin specific peptidase family member 8
Type:
Enzyme Catalytic Domain
Mol. Mass.:
24104.52
Organism:
Homo sapiens (Human)
Description:
gi_262118306
Residue:
212
  
Inhibitor
Name:
BDBM84025
Synonyms:
MLS-0446107.0001 N-(1,3-benzothiazol-2-yl)thiophene-3-carboxamide | cid_17483224
Type:
Small organic molecule
Emp. Form.:
C12H8N2OS2
Mol. Mass.:
260.335
SMILES:
O=C(Nc1nc2ccccc2s1)c1ccsc1
: