Target
Sentrin-specific protease 8
Ligand
BDBM84040
Substrate
Meas. Tech.
SAR Analysis of small molecule inhibitors of Sentrin-specific protease 8 (SENP8) using a Luminescent assay - Set 2
IC50
944±n/a nM
Citation
 PubChem, PC SAR Analysis of small molecule inhibitors of Sentrin-specific protease 8 (SENP8) using a Luminescent assay - Set 2 PubChem Bioassay (2011)[AID] 
Target
Name:
Sentrin-specific protease 8
Synonyms:
DEN1 PRSC2 SENP8_HUMAN | SUMO/sentrin specific peptidase family member 8
Type:
Enzyme Catalytic Domain
Mol. Mass.:
24104.52
Organism:
Homo sapiens (Human)
Description:
gi_262118306
Residue:
212
  
Inhibitor
Name:
BDBM84040
Synonyms:
MLS-0454428.0001 N-(6-butyl-1,3-benzothiazol-2-yl)-1-methyl-pyrrole-2-carboxamide cid_49852505
Type:
Small organic molecule
Emp. Form.:
C17H19N3OS
Mol. Mass.:
313.417
SMILES:
CCCCc1ccc2nc(NC(=O)c3cccn3C)sc2c1
: