Target
Multidrug resistance protein CDR2
Ligand
BDBM84118
Substrate
Meas. Tech.
Dose Response HTS singleplex for inhibitors of yeast efflux pump, specifically Cdr2 with Hit compounds from Cherry Pick1
EC50
14000±n/a nM
Citation
 PubChem, PC Dose Response HTS singleplex for inhibitors of yeast efflux pump, specifically Cdr2 with Hit compounds from Cherry Pick1 PubChem Bioassay (2011)[AID] 
Target
Name:
Multidrug resistance protein CDR2
Synonyms:
CDR2 drug resistance protein 2
Type:
Enzyme Catalytic Domain
Mol. Mass.:
168970.05
Organism:
Candida albicans
Description:
P78595
Residue:
1499
  
Inhibitor
Name:
BDBM84118
Synonyms:
MLS000736529 acetic acid;6-methoxy-4-[(E)-2-(6-methoxy-4-quinolinyl)ethenyl]quinoline acetic acid;6-methoxy-4-[(E)-2-(6-methoxyquinolin-4-yl)ethenyl]quinoline ethanoic acid;6-methoxy-4-[(E)-2-(6-methoxyquinolin-4-yl)ethenyl]quinoline
Type:
Small organic molecule
Emp. Form.:
C22H18N2O2
Mol. Mass.:
342.3905
SMILES:
COc1ccc2nccc(\C=C\c3ccnc4ccc(OC)cc34)c2c1
: