Target
Multidrug resistance protein CDR1
Ligand
BDBM58334
Substrate
Meas. Tech.
Dose Response HTS singleplex for inhibitors of yeast efflux pump, specifically Cdr1 with Hit compounds from Cherry Pick1
EC50
6050±n/a nM
Citation
 PubChem, PC Dose Response HTS singleplex for inhibitors of yeast efflux pump, specifically Cdr1 with Hit compounds from Cherry Pick1 PubChem Bioassay (2011)[AID] 
Target
Name:
Multidrug resistance protein CDR1
Synonyms:
CDR1 Multidrug resistance protein CDR1 | drug resistance protein 1
Type:
PROTEIN
Mol. Mass.:
169942.67
Organism:
Candida albicans
Description:
ChEMBL_708756
Residue:
1501
  
Inhibitor
Name:
BDBM58334
Synonyms:
(5Z)-2-(4-ethylanilino)-5-(4-hydroxy-3,5-dimethoxy-benzylidene)-2-thiazolin-4-one (5Z)-2-(4-ethylanilino)-5-[(4-hydroxy-3,5-dimethoxyphenyl)methylidene]-4-thiazolone 2-(4-Ethyl-phenylimino)-5-(4-hydroxy-3,5-dimethoxy-benzylidene)-thiazolidin-4-one SMR000517247 | cid_1938996
Type:
Small organic molecule
Emp. Form.:
C20H20N2O4S
Mol. Mass.:
384.449
SMILES:
CCc1ccc(NC2=NC(=O)C(S2)=Cc2cc(OC)c(O)c(OC)c2)cc1
: