Target
Multidrug resistance protein CDR1
Ligand
BDBM84138
Substrate
Meas. Tech.
Dose Response HTS singleplex for inhibitors of yeast efflux pump, specifically Cdr1 with Hit compounds from Cherry Pick1
EC50
8860±n/a nM
Citation
 PubChem, PC Dose Response HTS singleplex for inhibitors of yeast efflux pump, specifically Cdr1 with Hit compounds from Cherry Pick1 PubChem Bioassay (2011)[AID] 
Target
Name:
Multidrug resistance protein CDR1
Synonyms:
CDR1 Multidrug resistance protein CDR1 | drug resistance protein 1
Type:
PROTEIN
Mol. Mass.:
169942.67
Organism:
Candida albicans
Description:
ChEMBL_708756
Residue:
1501
  
Inhibitor
Name:
BDBM84138
Synonyms:
3-cyclohexyl-1-[[(2S,3S)-10-[(4-methoxyphenyl)carbamoylamino]-3-methyl-6-oxidanylidene-5-[(2R)-1-oxidanylpropan-2-yl]-3,4-dihydro-2H-1,5-benzoxazocin-2-yl]methyl]-1-methyl-urea 3-cyclohexyl-1-[[(2S,3S)-5-[(2R)-1-hydroxypropan-2-yl]-10-[(4-methoxyphenyl)carbamoylamino]-3-methyl-6-oxo-3,4-dihydro-2H-1,5-benzoxazocin-2-yl]methyl]-1-methylurea MLS002474356 cid_44202009
Type:
Small organic molecule
Emp. Form.:
C31H43N5O6
Mol. Mass.:
581.703
SMILES:
COc1ccc(NC(=O)Nc2cccc3c2O[C@H](CN(C)C(=O)NC2CCCCC2)[C@@H](C)CN([C@H](C)CO)C3=O)cc1
: