Target
Potassium voltage-gated channel subfamily KQT member 2
Ligand
BDBM77244
Substrate
Meas. Tech.
Dose response assay for compounds that inhibit KCNQ2 potassium channels on automated electrophysiological assay II
IC50
868.55±112.89 nM
Citation
 PubChem, PC Dose response assay for compounds that inhibit KCNQ2 potassium channels on automated electrophysiological assay II PubChem Bioassay (2011)[AID] 
Target
Name:
Potassium voltage-gated channel subfamily KQT member 2
Synonyms:
KCNQ2_RAT Voltage-gated potassium channel subunit Kv7.2 | potassium voltage-gated channel, KQT-like subfamily, member 2
Type:
PROTEIN
Mol. Mass.:
93984.01
Organism:
Rattus norvegicus
Description:
EBI_100117
Residue:
852
  
Inhibitor
Name:
BDBM77244
Synonyms:
2-[[2-(3-methoxyphenyl)-5-methyl-1,3-oxazol-4-yl]methylsulfonyl]-N-(1,2,3,4-tetrahydronaphthalen-1-yl)acetamide 2-[[2-(3-methoxyphenyl)-5-methyl-4-oxazolyl]methylsulfonyl]-N-(1,2,3,4-tetrahydronaphthalen-1-yl)acetamide MLS000522501 cid_9550784
Type:
Small organic molecule
Emp. Form.:
C24H26N2O5S
Mol. Mass.:
454.539
SMILES:
COc1cccc(c1)-c1nc(CS(=O)(=O)CC(=O)NC2CCCc3ccccc23)c(C)o1
: