Target
Potassium voltage-gated channel subfamily KQT member 2
Ligand
BDBM84178
Substrate
Meas. Tech.
Dose response assay for compounds that inhibit KCNQ2 potassium channels on automated electrophysiological assay II
IC50
1573.23±223.3 nM
Citation
 PubChem, PC Dose response assay for compounds that inhibit KCNQ2 potassium channels on automated electrophysiological assay II PubChem Bioassay (2011)[AID] 
Target
Name:
Potassium voltage-gated channel subfamily KQT member 2
Synonyms:
KCNQ2_RAT Voltage-gated potassium channel subunit Kv7.2 | potassium voltage-gated channel, KQT-like subfamily, member 2
Type:
PROTEIN
Mol. Mass.:
93984.01
Organism:
Rattus norvegicus
Description:
EBI_100117
Residue:
852
  
Inhibitor
Name:
BDBM84178
Synonyms:
2-[[2-(3-chloro-2-methyl-anilino)-2-keto-ethyl]amino]-3-phenyl-propionic acid methyl ester MLS001178216 cid_3956296 methyl 2-[[2-[(3-chloranyl-2-methyl-phenyl)amino]-2-oxidanylidene-ethyl]amino]-3-phenyl-propanoate
Type:
Small organic molecule
Emp. Form.:
C19H21ClN2O3
Mol. Mass.:
360.835
SMILES:
COC(=O)C(Cc1ccccc1)NCC(=O)Nc1cccc(Cl)c1C
: