Target
Beta-2 adrenergic receptor
Ligand
BDBM44818
Substrate
Meas. Tech.
Dose response for HTS for Beta-2AR agonists via FAP method from CP1
EC50
1380±n/a nM
Citation
 PubChem, PC Dose response for HTS for Beta-2AR agonists via FAP method from CP1 PubChem Bioassay (2011)[AID] 
Target
Name:
Beta-2 adrenergic receptor
Synonyms:
ADRB2 ADRB2_HUMAN Beta-2 adrenoceptor | Beta-2 adrenoreceptor
Type:
Mol. Mass.:
46461.69
Organism:
Homo sapiens (Human)
Description:
P07550
Residue:
413
  
Inhibitor
Name:
BDBM44818
Synonyms:
2,3-bis(oxidanyl)butanedioic acid;4-[(1R)-2-(methylamino)-1-oxidanyl-ethyl]benzene-1,2-diol 4-[(1R)-1-hydroxy-2-(methylamino)ethyl]pyrocatechol;tartaric acid MLS000028381 cid_6852374
Type:
Small organic molecule
Emp. Form.:
C9H13NO3
Mol. Mass.:
183.2044
SMILES:
CNC[C@H](O)c1ccc(O)c(O)c1
: