Target
Beta-2 adrenergic receptor
Ligand
BDBM54207
Substrate
Meas. Tech.
Dose response for HTS for Beta-2AR agonists via FAP method from CP1
EC50
64100±n/a nM
Citation
 PubChem, PC Dose response for HTS for Beta-2AR agonists via FAP method from CP1 PubChem Bioassay (2011)[AID] 
Target
Name:
Beta-2 adrenergic receptor
Synonyms:
ADRB2 ADRB2_HUMAN Beta-2 adrenoceptor | Beta-2 adrenoreceptor
Type:
Mol. Mass.:
46461.69
Organism:
Homo sapiens (Human)
Description:
P07550
Residue:
413
  
Inhibitor
Name:
BDBM54207
Synonyms:
MLS000538647 N-[4-(3,4-dimethylphenyl)-5-methyl-1,3-thiazol-2-yl]-1-methyl-4-nitropyrazole-3-carboxamide N-[4-(3,4-dimethylphenyl)-5-methyl-2-thiazolyl]-1-methyl-4-nitro-3-pyrazolecarboxamide SMR000160112 | cid_998879
Type:
Small organic molecule
Emp. Form.:
C17H17N5O3S
Mol. Mass.:
371.414
SMILES:
Cc1sc(NC(=O)c2nn(C)cc2[N+]([O-])=O)nc1-c1ccc(C)c(C)c1
: