Target
Beta-2 adrenergic receptor
Ligand
BDBM84236
Substrate
Meas. Tech.
Dose response for HTS for Beta-2AR agonists via FAP method from CP1
EC50
39.3±n/a nM
Citation
 PubChem, PC Dose response for HTS for Beta-2AR agonists via FAP method from CP1 PubChem Bioassay (2011)[AID] 
Target
Name:
Beta-2 adrenergic receptor
Synonyms:
ADRB2 ADRB2_HUMAN Beta-2 adrenoceptor | Beta-2 adrenoreceptor
Type:
Mol. Mass.:
46461.69
Organism:
Homo sapiens (Human)
Description:
P07550
Residue:
413
  
Inhibitor
Name:
BDBM84236
Synonyms:
6-(2,4-diketo-1H-thieno[3,2-d]pyrimidin-3-yl)-N-piperonyl-hexanamide N-(1,3-benzodioxol-5-ylmethyl)-6-(2,4-dioxo-1H-thieno[3,2-d]pyrimidin-3-yl)hexanamide SMR000130304 | cid_11957285
Type:
Small organic molecule
Emp. Form.:
C20H21N3O5S
Mol. Mass.:
415.463
SMILES:
O=C(CCCCCn1c(=O)[nH]c2ccsc2c1=O)NCc1ccc2OCOc2c1
: