Target
Beta-2 adrenergic receptor
Ligand
BDBM41093
Substrate
Meas. Tech.
Dose response for HTS for Beta-2AR agonists via FAP method from CP1
EC50
7220±n/a nM
Citation
 PubChem, PC Dose response for HTS for Beta-2AR agonists via FAP method from CP1 PubChem Bioassay (2011)[AID] 
Target
Name:
Beta-2 adrenergic receptor
Synonyms:
ADRB2 ADRB2_HUMAN Beta-2 adrenoceptor | Beta-2 adrenoreceptor
Type:
Mol. Mass.:
46461.69
Organism:
Homo sapiens (Human)
Description:
P07550
Residue:
413
  
Inhibitor
Name:
BDBM41093
Synonyms:
3,6-bis(chloranyl)-N-[3-([1,3]oxazolo[4,5-b]pyridin-2-yl)phenyl]-1-benzothiophene-2-carboxamide 3,6-dichloro-N-(3-oxazolo[4,5-b]pyridin-2-ylphenyl)benzothiophene-2-carboxamide 3,6-dichloro-N-[3-([1,3]oxazolo[4,5-b]pyridin-2-yl)phenyl]-1-benzothiophene-2-carboxamide SMR000200786 | cid_2013595
Type:
Small organic molecule
Emp. Form.:
C21H11Cl2N3O2S
Mol. Mass.:
440.302
SMILES:
Clc1c(sc2cc(Cl)ccc12)C(=O)Nc1cccc(c1)-c1nc2ncccc2o1
: