Target
Beta-2 adrenergic receptor
Ligand
BDBM84268
Substrate
Meas. Tech.
Dose response for HTS for Beta-2AR agonists via FAP method from CP1
EC50
7470±n/a nM
Citation
 PubChem, PC Dose response for HTS for Beta-2AR agonists via FAP method from CP1 PubChem Bioassay (2011)[AID] 
Target
Name:
Beta-2 adrenergic receptor
Synonyms:
ADRB2 ADRB2_HUMAN Beta-2 adrenoceptor | Beta-2 adrenoreceptor
Type:
Mol. Mass.:
46461.69
Organism:
Homo sapiens (Human)
Description:
P07550
Residue:
413
  
Inhibitor
Name:
BDBM84268
Synonyms:
MLS000673419 N-[1-(4-hydroxybenzyl)cyclohexyl]-2-phenylacetamide N-[1-[(4-hydroxyphenyl)methyl]cyclohexyl]-2-phenylacetamide cid_567055
Type:
Small organic molecule
Emp. Form.:
C21H25NO2
Mol. Mass.:
323.4287
SMILES:
Oc1ccc(CC2(CCCCC2)NC(=O)Cc2ccccc2)cc1
: