Target
M-phase inducer phosphatase 1
Ligand
BDBM84503
Substrate
Meas. Tech.
Phosphatase Inhibition Assay
pH
8±0
Temperature
310.15±0 K
IC50
>5.0e+4± 3e+3 nM
Citation
 Fürstner, AReinecke, KPrinz, HWaldmann, H The core structures of roseophilin and the prodigiosin alkaloids define a new class of protein tyrosine phosphatase inhibitors. Chembiochem 5:1575-9 (2004)  
Target
Name:
M-phase inducer phosphatase 1
Synonyms:
CDC25A Dual specificity phosphatase Cdc25A MPIP1_HUMAN | phosphatase Cdc25
Type:
Protein
Mol. Mass.:
59090.18
Organism:
Homo sapiens (Human)
Description:
P30304
Residue:
524
  
Inhibitor
Name:
BDBM84503
Synonyms:
Cyclic analogue, 9
Type:
Small organic molecule
Emp. Form.:
C25H28N2O
Mol. Mass.:
372.5026
SMILES:
COC1=CC2=N\C1=C/c1ccc(CCCC\C=C\CCCc3cccc2c3)[nH]1
: