Target
Dual specificity protein phosphatase 3
Ligand
BDBM84510
Substrate
Meas. Tech.
Phosphatase Inhibition Assay
pH
6.5±0
Temperature
310.15±0 K
IC50
>5.0e+4±n/a nM
Citation
 Fürstner, AReinecke, KPrinz, HWaldmann, H The core structures of roseophilin and the prodigiosin alkaloids define a new class of protein tyrosine phosphatase inhibitors. Chembiochem 5:1575-9 (2004)  
Target
Name:
Dual specificity protein phosphatase 3
Synonyms:
DUS3_HUMAN Dual specificity protein phosphatase (VHR) Dual specificity protein phosphatase VHR Tyrosine-protein phosphatase non-receptor type 1 | VHR
Type:
Hydrolase
Mol. Mass.:
20480.58
Organism:
Homo sapiens (Human)
Description:
Residue:
185
  
Inhibitor
Name:
BDBM84510
Synonyms:
Acyclic analogue, 17
Type:
Small organic molecule
Emp. Form.:
C12H14N2O2
Mol. Mass.:
218.2518
SMILES:
CCc1ccc(\C=C2/NC(=O)C=C2OC)[nH]1
: