Target
Glycogen synthase kinase-3 beta
Ligand
BDBM7262
Substrate
Meas. Tech.
Kinase Assay
pH
7.5±0
Temperature
303.15±0 K
IC50
4±0.0 nM
Citation
 Kunick, CZeng, ZGussio, RZaharevitz, DLeost, MTotzke, FSchächtele, CKubbutat, MHMeijer, LLemcke, T Structure-aided optimization of kinase inhibitors derived from alsterpaullone. Chembiochem 6:541-9 (2005)  
Target
Name:
Glycogen synthase kinase-3 beta
Synonyms:
GSK-3 beta GSK3B Glycogen synthase kinase 3 beta (GSK3B) Glycogen synthase kinase-3 beta (GSK-3B) Glycogen synthase kinase-3 beta (GSK3B) Glycogen synthase kinase-3beta (GSK3B) | Serine/threonine-protein kinase GSK3B
Type:
Enzyme
Mol. Mass.:
46756.38
Organism:
Homo sapiens (Human)
Description:
P49841
Residue:
420
  
Inhibitor
Name:
BDBM7262
Synonyms:
14-nitro-8,18-diazatetracyclo[9.7.0.0^{2,7}.0^{12,17}]octadeca-1(11),2,4,6,12(17),13,15-heptaen-9-one BDBM84528 NSC 705701 alsterpaullone
Type:
Small organic molecule
Emp. Form.:
C16H11N3O3
Mol. Mass.:
293.2768
SMILES:
[O-][N+](=O)c1ccc2[nH]c-3c(CC(=O)Nc4ccccc-34)c2c1
: