Target
Insulin receptor
Ligand
BDBM84553
Substrate
Meas. Tech.
Inhibition Assay
pH
7.5±0
Temperature
295.15±0 K
IC50
>1.0e+4±n/a nM
Citation
 Jautelat, RBrumby, TSchäfer, MBriem, HEisenbrand, GSchwahn, SKrüger, MLücking, UPrien, OSiemeister, G From the insoluble dye indirubin towards highly active, soluble CDK2-inhibitors. Chembiochem 6:531-40 (2005)  
Target
Name:
Insulin receptor
Synonyms:
INSR INSR_HUMAN Insulin receptor beta subunit
Type:
Receptor Tyrosine Kinase
Mol. Mass.:
156322.60
Organism:
Homo sapiens (Human)
Description:
P06213
Residue:
1382
  
Inhibitor
Name:
BDBM84553
Synonyms:
Indirubin derivative, 28a | Indirubin derivative, 28b
Type:
Small organic molecule
Emp. Form.:
C22H26N4O4S
Mol. Mass.:
442.531
SMILES:
CN(C)CCN(C)S(=O)(=O)c1ccc2NC(=O)C(C3=Nc4ccccc4C3(C)O)c2c1
: