Target
Kit ligand
Ligand
BDBM84534
Substrate
Meas. Tech.
Inhibition Assay
pH
7±0
Temperature
295.15±0 K
IC50
>1.0e+4±n/a nM
Citation
 Jautelat, RBrumby, TSchäfer, MBriem, HEisenbrand, GSchwahn, SKrüger, MLücking, UPrien, OSiemeister, G From the insoluble dye indirubin towards highly active, soluble CDK2-inhibitors. Chembiochem 6:531-40 (2005)  
Target
Name:
Kit ligand
Synonyms:
KITLG Mast cell growth factor SCF_HUMAN c-Kit ligand
Type:
Protein
Mol. Mass.:
30897.20
Organism:
Homo sapiens (Human)
Description:
P21583
Residue:
273
  
Inhibitor
Name:
BDBM84534
Synonyms:
Indirubin derivative, 20
Type:
Small organic molecule
Emp. Form.:
C16H10N2O5S
Mol. Mass.:
342.326
SMILES:
OS(=O)(=O)c1ccc2NC(=O)C(=C3Nc4ccccc4C3=O)c2c1
: