Target
Alpha-mannosidase 2
Ligand
BDBM84614
Substrate
Meas. Tech.
Inhibition Assay
Ki
150±0.0 nM
Citation
 Kuntz, DAZhong, WGuo, JRose, DRBoons, GJ The molecular basis of inhibition of Golgi alpha-mannosidase II by mannostatin A. Chembiochem 10:268-77 (2009)  
Target
Name:
Alpha-mannosidase 2
Synonyms:
Alpha-mannosidase 2 Golgi alpha-mannosidase II alpha-Man-IIa
Type:
Protein
Mol. Mass.:
126735.79
Organism:
Drosophila melanogaster (Fruit fly)
Description:
Q24451
Residue:
1108
  
Inhibitor
Name:
BDBM84614
Synonyms:
Mannostatin B, 2
Type:
Small organic molecule
Emp. Form.:
C6H13NO4S
Mol. Mass.:
195.237
SMILES:
CS(=O)[C@@H]1[C@@H](N)[C@@H](O)[C@@H](O)[C@H]1O
: