Target
Bromodomain-containing protein 3
Ligand
BDBM274223
Substrate
Meas. Tech.
TR-FRET In-Vitro Binding Assay
pH
7.5±n/a
IC50
14.0±n/a nM
Comments
extracted
Citation
 Rueger, HBlank, JBordas, VCotesta, SBold, GGuagnano, VVaupel, A Pyrrolopyrrolone derivatives and their use as BET inhibitors US Patent  US9550796 Publication Date 1/24/2017 
Target
Name:
Bromodomain-containing protein 3
Synonyms:
BRD3 Bromodomain and extra-terminal motif (BET) Bromodomain-containing protein 3 (BRD3) RING3-like protein | RING3L
Type:
Protein
Mol. Mass.:
79571.81
Organism:
Homo sapiens (Human)
Description:
Q15059
Residue:
726
  
Inhibitor
Name:
BDBM274223
Synonyms:
6-(4-chlorophenyl)-3-cyclopropyl-5-(3,8-dimethyl-[1,2,4]triazolo[4,3-a]pyridin-6-yl)-1-(oxetan-3-yl)-5,6-dihydropyrrolo[3,4-b]pyrrol-4(1H)-one | US9550796, Example 18
Type:
Small organic molecule
Emp. Form.:
C26H24ClN5O2
Mol. Mass.:
473.954
SMILES:
Cc1nnc2c(C)cc(cn12)N1C(c2c(C1=O)c(cn2C1COC1)C1CC1)c1ccc(Cl)cc1
: