Target
CREB-binding protein
Ligand
BDBM274240
Substrate
Meas. Tech.
Assay for CREB protein
pH
7.5±n/a
Temperature
303.15±n/a K
IC50
1900±n/a nM
Comments
extracted
Citation
 Rueger, HBlank, JBordas, VCotesta, SBold, GGuagnano, VVaupel, A Pyrrolopyrrolone derivatives and their use as BET inhibitors US Patent  US9550796 Publication Date 1/24/2017 
Target
Name:
CREB-binding protein
Synonyms:
CBP CREB-binding protein (CBP) CREBBP
Type:
Transcription Coactivator
Mol. Mass.:
265411.66
Organism:
Homo sapiens (Human)
Description:
Q92793
Residue:
2442
  
Inhibitor
Name:
BDBM274240
Synonyms:
6-(4-chlorophenyl)-3-cyclopropyl-5-(1,5-dimethyl-6-oxo-1,6-dihydropyridin-3-yl)-1-methyl-5,6-dihydropyrrolo[3,4-b]pyrrol-4(1H)-one | US9550796, Example 37
Type:
Small organic molecule
Emp. Form.:
C23H22ClN3O2
Mol. Mass.:
407.893
SMILES:
Cc1cc(cn(C)c1=O)N1C(c2c(C1=O)c(cn2C)C1CC1)c1ccc(Cl)cc1
: