Target
CREB-binding protein
Ligand
BDBM274241
Substrate
Meas. Tech.
Assay for CREB protein
pH
7.5±n/a
Temperature
303.15±n/a K
IC50
205±n/a nM
Comments
extracted
Citation
 Rueger, HBlank, JBordas, VCotesta, SBold, GGuagnano, VVaupel, A Pyrrolopyrrolone derivatives and their use as BET inhibitors US Patent  US9550796 Publication Date 1/24/2017 
Target
Name:
CREB-binding protein
Synonyms:
CBP CREB-binding protein (CBP) CREBBP
Type:
Transcription Coactivator
Mol. Mass.:
265411.66
Organism:
Homo sapiens (Human)
Description:
Q92793
Residue:
2442
  
Inhibitor
Name:
BDBM274241
Synonyms:
5-(5-chloro-1-methyl-6-oxo-1,6-dihydropyridin-3-yl)-6-(4-chlorophenyl)-2-(2,4-dimethoxypyrimidin-5-yl)-1-methyl-5,6-dihydropyrrolo[3,4-b]pyrrol-4(1H)-one | US9550796, Example 38
Type:
Small organic molecule
Emp. Form.:
C25H21Cl2N5O4
Mol. Mass.:
526.371
SMILES:
COc1ncc(-c2cc3C(=O)N(C(c3n2C)c2ccc(Cl)cc2)c2cc(Cl)c(=O)n(C)c2)c(OC)n1
: