Target
Bromodomain-containing protein 3
Ligand
BDBM274248
Substrate
Meas. Tech.
TR-FRET In-Vitro Binding Assay
pH
7.5±n/a
IC50
18.5±n/a nM
Comments
extracted
Citation
 Rueger, HBlank, JBordas, VCotesta, SBold, GGuagnano, VVaupel, A Pyrrolopyrrolone derivatives and their use as BET inhibitors US Patent  US9550796 Publication Date 1/24/2017 
Target
Name:
Bromodomain-containing protein 3
Synonyms:
BRD3 Bromodomain and extra-terminal motif (BET) Bromodomain-containing protein 3 (BRD3) RING3-like protein | RING3L
Type:
Protein
Mol. Mass.:
79571.81
Organism:
Homo sapiens (Human)
Description:
Q15059
Residue:
726
  
Inhibitor
Name:
BDBM274248
Synonyms:
6-(4-chlorophenyl)-5-(1,5-dimethyl-6-oxo-1,6-dihydropyridin-3-yl)-1-methyl-2-(1-methyl-2-oxo-1,2-dihydropyridin-4-yl)-5,6-dihydropyrrolo[3,4-b]pyrrol-4(1H)-one | US9550796, Example 45
Type:
Small organic molecule
Emp. Form.:
C26H23ClN4O3
Mol. Mass.:
474.939
SMILES:
Cc1cc(cn(C)c1=O)N1C(c2c(cc(-c3ccn(C)c(=O)c3)n2C)C1=O)c1ccc(Cl)cc1
: