Target
Bromodomain-containing protein 3
Ligand
BDBM274259
Substrate
Meas. Tech.
TR-FRET In-Vitro Binding Assay
pH
7.5±n/a
IC50
22.0±n/a nM
Comments
extracted
Citation
 Rueger, HBlank, JBordas, VCotesta, SBold, GGuagnano, VVaupel, A Pyrrolopyrrolone derivatives and their use as BET inhibitors US Patent  US9550796 Publication Date 1/24/2017 
Target
Name:
Bromodomain-containing protein 3
Synonyms:
BRD3 Bromodomain and extra-terminal motif (BET) Bromodomain-containing protein 3 (BRD3) RING3-like protein | RING3L
Type:
Protein
Mol. Mass.:
79571.81
Organism:
Homo sapiens (Human)
Description:
Q15059
Residue:
726
  
Inhibitor
Name:
BDBM274259
Synonyms:
(R)-6-(4-chlorophenyl)-5-(1,5-dimethyl-6-oxo-1,6-dihydropyridin-3-yl)-2-(2-methoxypyrimidin-5-yl)-1-methyl-5,6-dihydropyrrolo[3,4-b]pyrrol-4(1H)-one | US9550796, Example 56
Type:
Small organic molecule
Emp. Form.:
C25H22ClN5O3
Mol. Mass.:
475.927
SMILES:
COc1ncc(cn1)-c1cc2C(=O)N([C@@H](c2n1C)c1ccc(Cl)cc1)c1cc(C)c(=O)n(C)c1
: