Target
CREB-binding protein
Ligand
BDBM274286
Substrate
Meas. Tech.
Assay for CREB protein
pH
7.5±n/a
Temperature
303.15±n/a K
IC50
4100±n/a nM
Comments
extracted
Citation
 Rueger, HBlank, JBordas, VCotesta, SBold, GGuagnano, VVaupel, A Pyrrolopyrrolone derivatives and their use as BET inhibitors US Patent  US9550796 Publication Date 1/24/2017 
Target
Name:
CREB-binding protein
Synonyms:
CBP CREB-binding protein (CBP) CREBBP
Type:
Transcription Coactivator
Mol. Mass.:
265411.66
Organism:
Homo sapiens (Human)
Description:
Q92793
Residue:
2442
  
Inhibitor
Name:
BDBM274286
Synonyms:
5-(5-chloro-1-methyl-6-oxo-1,6-dihydropyridin-3-yl)-1-methyl-6-(p-tolyl)-5,6-dihydropyrrolo[3,4-b]pyrrol-4(1H)-one | US9550796, Example 87
Type:
Small organic molecule
Emp. Form.:
C20H18ClN3O2
Mol. Mass.:
367.829
SMILES:
Cc1ccc(cc1)C1N(C(=O)c2ccn(C)c12)c1cc(Cl)c(=O)n(C)c1
: