Target
Bromodomain-containing protein 3
Ligand
BDBM274296
Substrate
Meas. Tech.
TR-FRET In-Vitro Binding Assay
pH
7.5±n/a
IC50
<11.0±n/a nM
Comments
extracted
Citation
 Rueger, HBlank, JBordas, VCotesta, SBold, GGuagnano, VVaupel, A Pyrrolopyrrolone derivatives and their use as BET inhibitors US Patent  US9550796 Publication Date 1/24/2017 
Target
Name:
Bromodomain-containing protein 3
Synonyms:
BRD3 Bromodomain and extra-terminal motif (BET) Bromodomain-containing protein 3 (BRD3) RING3-like protein | RING3L
Type:
Protein
Mol. Mass.:
79571.81
Organism:
Homo sapiens (Human)
Description:
Q15059
Residue:
726
  
Inhibitor
Name:
BDBM274296
Synonyms:
Ethyl (6-(4-chlorophenyl)-5-(3,7-dimethyl-3H-[1,2,3]triazolo[4,5-b]pyridin-5-yl)-1-methyl-4-oxo-1,4,5,6-tetrahydropyrrolo[3,4-b]pyrrol-3-yl)carbamate | US9550796, Example 97
Type:
Small organic molecule
Emp. Form.:
C23H22ClN7O3
Mol. Mass.:
479.919
SMILES:
CCOC(=O)Nc1cn(C)c2C(N(C(=O)c12)c1cc(C)c2nnn(C)c2n1)c1ccc(Cl)cc1
: