Target
Bromodomain-containing protein 3
Ligand
BDBM274316
Substrate
Meas. Tech.
TR-FRET In-Vitro Binding Assay
pH
7.5±n/a
IC50
17.0±n/a nM
Comments
extracted
Citation
 Rueger, HBlank, JBordas, VCotesta, SBold, GGuagnano, VVaupel, A Pyrrolopyrrolone derivatives and their use as BET inhibitors US Patent  US9550796 Publication Date 1/24/2017 
Target
Name:
Bromodomain-containing protein 3
Synonyms:
BRD3 Bromodomain and extra-terminal motif (BET) Bromodomain-containing protein 3 (BRD3) RING3-like protein | RING3L
Type:
Protein
Mol. Mass.:
79571.81
Organism:
Homo sapiens (Human)
Description:
Q15059
Residue:
726
  
Inhibitor
Name:
BDBM274316
Synonyms:
3-(1-acetylazetidin-3-yl)-6-(4-chlorophenyl)-5-(3,8-dimethyl-[1,2,4]triazolo[4,3-a]pyridin-6-yl)-1-methyl-5,6-dihydropyrrolo[3,4-b]pyrrol-4(1H)-one | US9550796, Example 117
Type:
Small organic molecule
Emp. Form.:
C26H25ClN6O2
Mol. Mass.:
488.969
SMILES:
CC(=O)N1CC(C1)c1cn(C)c2C(N(C(=O)c12)c1cc(C)c2nnc(C)n2c1)c1ccc(Cl)cc1
: