Target
Somatostatin receptor type 3
Ligand
BDBM84642
Substrate
Ki
73±n/a nM
Comments
PDSP_997
Citation
 Raynor, KMurphy, WACoy, DHTaylor, JEMoreau, JPYasuda, KBell, GIReisine, T Cloned somatostatin receptors: identification of subtype-selective peptides and demonstration of high affinity binding of linear peptides. Mol Pharmacol 43:838-44 (1993) Target
Name:
Somatostatin receptor type 3
Synonyms:
SOMATOSTATIN SST3 SSR-28 Smstr3 Somatostatin receptor 3 Sstr3
Type:
Enzyme Catalytic Domain
Mol. Mass.:
47225.49
Organism:
MOUSE
Description:
SOMATOSTATIN SST3 SSTR3 MOUSE::P30935
Residue:
428
  
Inhibitor
Name:
BDBM84642
Synonyms:
SA IV | c[Ahx-Phe-D-Trp-Lys-Thr(Bzl)]
Type:
Small organic molecule
Emp. Form.:
C44H58N8O6
Mol. Mass.:
794.9813
SMILES:
CC(OCc1ccccc1)C1NC(=O)C(CCCCCCN)NC(=O)C(Cc2ccccc2)NC(=O)C(Cc2c[nH]c3ccccc23)NC(=O)C(CCCN)NC1=O
: