Target
5-hydroxytryptamine receptor 1F
Ligand
BDBM28582
Substrate
Ki
1739±n/a nM
Comments
PDSP_719
Citation
 Adham, NKao, HTSchecter, LEBard, JOlsen, MUrquhart, DDurkin, MHartig, PRWeinshank, RLBranchek, TA Cloning of another human serotonin receptor (5-HT1F): a fifth 5-HT1 receptor subtype coupled to the inhibition of adenylate cyclase. Proc Natl Acad Sci U S A 90:408-12 (1993)  
Target
Name:
5-hydroxytryptamine receptor 1F
Synonyms:
5-HT-1F 5-hydroxytryptamine receptor 1F HTR1EL Serotonin (5-HT) receptor Serotonin receptor 1F
Type:
Enzyme Catalytic Domain
Mol. Mass.:
41724.68
Organism:
Homo sapiens (Human)
Description:
5-HT1F HTR1F HUMAN::P30939
Residue:
366
  
Inhibitor
Name:
BDBM28582
Synonyms:
1-(4-iodo-2,5-dimethoxyphenyl)propan-2-amine DOI DOI,(-) [125I]4-iodo-2,5-dimethoxyphenylisopropylamine | [125I]DOI
Type:
radiolabeled ligand
Emp. Form.:
C11H16INO2
Mol. Mass.:
321.1547
SMILES:
COc1cc(CC(C)N)c(OC)cc1I
: