Target
Queuine tRNA-ribosyltransferase
Ligand
BDBM84657
Substrate
Meas. Tech.
Enzyme Assay
pH
7.3±0
Ki
5.8± 3.6 nM
Citation
 Ritschel, THoertner, SHeine, ADiederich, FKlebe, G Crystal structure analysis and in silico pKa calculations suggest strong pKa shifts of ligands as driving force for high-affinity binding to TGT. Chembiochem 10:716-27 (2009)  
Target
Name:
Queuine tRNA-ribosyltransferase
Synonyms:
TGT_ZYMMO tRNA-guanine transglycosylase (TGT) | tgt
Type:
Protein
Mol. Mass.:
42844.19
Organism:
Zymomonas mobilis
Description:
P28720
Residue:
386
  
Inhibitor
Name:
BDBM84657
Synonyms:
lin-benzoguanine scaffold, 6
Type:
Small organic molecule
Emp. Form.:
C10H10N6O
Mol. Mass.:
230.226
SMILES:
CNc1nc2cc3nc(N)[nH]c(=O)c3cc2[nH]1
: