Target
P2X purinoceptor 7
Ligand
BDBM274338
Substrate
Meas. Tech.
In Vitro Assay
IC50
35.0±n/a nM
Citation
 Hilpert, KHubler, FRenneberg, DStamm, S Indole carboxamide derivatives as P2X7 receptor antagonists US Patent  US9556117 Publication Date 1/31/2017 
Target
Name:
P2X purinoceptor 7
Synonyms:
ATP receptor P2RX7_HUMAN P2X purinoceptor 7 (P2X7) P2Z receptor | Purinergic receptor
Type:
Protein
Mol. Mass.:
68602.85
Organism:
Homo sapiens (Human)
Description:
Q99572
Residue:
595
  
Inhibitor
Name:
BDBM274338
Synonyms:
US95556117, Example 2,4-Chloro-1H-indole-5-carboxylicacid (1-hydroxy-cyclohexylmethyl)-amide
Type:
Small Organic Molecule
Emp. Form.:
C16H19ClN2O2
Mol. Mass.:
306.787
SMILES:
OC1(CNC(=O)c2ccc3[nH]ccc3c2Cl)CCCCC1
: