Target
P2X purinoceptor 7
Ligand
BDBM274363
Substrate
Meas. Tech.
In Vitro Assay
IC50
682±n/a nM
Citation
 Hilpert, KHubler, FRenneberg, DStamm, S Indole carboxamide derivatives as P2X7 receptor antagonists US Patent  US9556117 Publication Date 1/31/2017 
Target
Name:
P2X purinoceptor 7
Synonyms:
ATP receptor P2RX7_HUMAN P2X purinoceptor 7 (P2X7) P2Z receptor | Purinergic receptor
Type:
Protein
Mol. Mass.:
68602.85
Organism:
Homo sapiens (Human)
Description:
Q99572
Residue:
595
  
Inhibitor
Name:
BDBM274363
Synonyms:
US95556117, Example 27,4-Methoxy-1H-indole-5-carboxylic acid (1-hydroxy-cycloheptylmethyl)-amide
Type:
Small Organic Molecule
Emp. Form.:
C18H24N2O3
Mol. Mass.:
316.3948
SMILES:
COc1c(ccc2[nH]ccc12)C(=O)NCC1(O)CCCCCC1
: