Target
P2X purinoceptor 7
Ligand
BDBM274383
Substrate
Meas. Tech.
In Vitro Assay
IC50
21.0±n/a nM
Citation
 Hilpert, KHubler, FRenneberg, DStamm, S Indole carboxamide derivatives as P2X7 receptor antagonists US Patent  US9556117 Publication Date 1/31/2017 
Target
Name:
P2X purinoceptor 7
Synonyms:
ATP receptor P2RX7_HUMAN P2X purinoceptor 7 (P2X7) P2Z receptor | Purinergic receptor
Type:
Protein
Mol. Mass.:
68602.85
Organism:
Homo sapiens (Human)
Description:
Q99572
Residue:
595
  
Inhibitor
Name:
BDBM274383
Synonyms:
US95556117, Example 47,4-Chloro-1H-indole-5-carboxylicacid (1-methanesulfonylamino-cyclohexylmethyl)-amide
Type:
Small Organic Molecule
Emp. Form.:
C17H22ClN3O3S
Mol. Mass.:
383.893
SMILES:
CS(=O)(=O)NC1(CNC(=O)c2ccc3[nH]ccc3c2Cl)CCCCC1
: