Target
P2X purinoceptor 7
Ligand
BDBM274413
Substrate
Meas. Tech.
In Vitro Assay
IC50
21.0±n/a nM
Citation
 Hilpert, KHubler, FRenneberg, DStamm, S Indole carboxamide derivatives as P2X7 receptor antagonists US Patent  US9556117 Publication Date 1/31/2017 
Target
Name:
P2X purinoceptor 7
Synonyms:
ATP receptor P2RX7_HUMAN P2X purinoceptor 7 (P2X7) P2Z receptor | Purinergic receptor
Type:
Protein
Mol. Mass.:
68602.85
Organism:
Homo sapiens (Human)
Description:
Q99572
Residue:
595
  
Inhibitor
Name:
BDBM274413
Synonyms:
US95556117, Example 77,7-Methoxy-4-methyl-1H-indole-5-carboxylic acid (4,4-difluoro-1-hydroxy-cyclohexylmethyl)-amide
Type:
Small Organic Molecule
Emp. Form.:
C18H22F2N2O3
Mol. Mass.:
352.3757
SMILES:
COc1cc(C(=O)NCC2(O)CCC(F)(F)CC2)c(C)c2cc[nH]c12
: