Target
P2X purinoceptor 7
Ligand
BDBM274420
Substrate
Meas. Tech.
In Vitro Assay
IC50
25.0±n/a nM
Citation
 Hilpert, KHubler, FRenneberg, DStamm, S Indole carboxamide derivatives as P2X7 receptor antagonists US Patent  US9556117 Publication Date 1/31/2017 
Target
Name:
P2X purinoceptor 7
Synonyms:
ATP receptor P2RX7_HUMAN P2X purinoceptor 7 (P2X7) P2Z receptor | Purinergic receptor
Type:
Protein
Mol. Mass.:
68602.85
Organism:
Homo sapiens (Human)
Description:
Q99572
Residue:
595
  
Inhibitor
Name:
BDBM274420
Synonyms:
US95556117, Example 84,7-(2-tert-Butoxy-ethoxy)-4-chloro-1H-indole-5-carboxylicacid (1-hydroxy-cyclohexylmethyl)-amide
Type:
Small Organic Molecule
Emp. Form.:
C22H31ClN2O4
Mol. Mass.:
422.946
SMILES:
CC(C)(C)OCCOc1cc(C(=O)NCC2(O)CCCCC2)c(Cl)c2cc[nH]c12
: