Target
Cytochrome P450 2A6
Ligand
BDBM84670
Substrate
Meas. Tech.
Inhibition Assay
pH
7.6±0
Temperature
310.15±0 K
IC50
1.10e+4± 1.9e+3 nM
Citation
 Chougnet, AWoggon, WDLocher, ESchilling, B Synthesis and in vitro activity of heterocyclic inhibitors of CYP2A6 and CYP2A13, two cytochrome P450 enzymes present in the respiratory tract. Chembiochem 10:1562-7 (2009)  
Target
Name:
Cytochrome P450 2A6
Synonyms:
1,4-cineole 2-exo-monooxygenase CP2A6_HUMAN CYP2A6 Coumarin 7-hydroxylase Cytochrome P450 IIA3 | Cytochrome P450(I)
Type:
Protein
Mol. Mass.:
56514.34
Organism:
Homo sapiens (Human)
Description:
P11509
Residue:
494
  
Inhibitor
Name:
BDBM84670
Synonyms:
1-Subsituted 1H-imidazole, 5
Type:
Small organic molecule
Emp. Form.:
C10H18N2
Mol. Mass.:
166.2633
SMILES:
CCCCCCCn1ccnc1
: