Target
Cytochrome P450 2A13
Ligand
BDBM84674
Substrate
Meas. Tech.
Inhibition Assay
pH
7.6±0
Temperature
310.15±0 K
IC50
6.8e+3± 7e+2 nM
Citation
 Chougnet, AWoggon, WDLocher, ESchilling, B Synthesis and in vitro activity of heterocyclic inhibitors of CYP2A6 and CYP2A13, two cytochrome P450 enzymes present in the respiratory tract. Chembiochem 10:1562-7 (2009)  
Target
Name:
Cytochrome P450 2A13
Synonyms:
CP2AD_HUMAN CYPIIA13 | Cytochrome P450 2A13 (CYP2A13)
Type:
Protein
Mol. Mass.:
56702.46
Organism:
Homo sapiens (Human)
Description:
Q16696
Residue:
494
  
Inhibitor
Name:
BDBM84674
Synonyms:
1-Subsituted 1H-imidazole, 11 | 1-Subsituted 1H-imidazole, 12
Type:
Small organic molecule
Emp. Form.:
C9H14N2
Mol. Mass.:
150.2209
SMILES:
CC\C=C\CCn1ccnc1
: