Target
Cytochrome P450 2A6
Ligand
BDBM84694
Substrate
Meas. Tech.
Inhibition Assay
pH
7.6±0
Temperature
310.15±0 K
IC50
2.38e+4± 2.2e+3 nM
Citation
 Chougnet, AWoggon, WDLocher, ESchilling, B Synthesis and in vitro activity of heterocyclic inhibitors of CYP2A6 and CYP2A13, two cytochrome P450 enzymes present in the respiratory tract. Chembiochem 10:1562-7 (2009)  
Target
Name:
Cytochrome P450 2A6
Synonyms:
1,4-cineole 2-exo-monooxygenase CP2A6_HUMAN CYP2A6 Coumarin 7-hydroxylase Cytochrome P450 IIA3 | Cytochrome P450(I)
Type:
Protein
Mol. Mass.:
56514.34
Organism:
Homo sapiens (Human)
Description:
P11509
Residue:
494
  
Inhibitor
Name:
BDBM84694
Synonyms:
2-Subsituted pyrazine, 34
Type:
Small organic molecule
Emp. Form.:
C11H16N2
Mol. Mass.:
176.2581
SMILES:
C=CCCCCCc1cnccn1
: