Target
Progonadoliberin-1
Ligand
BDBM84716
Substrate
Ki
346.74±n/a nM
Comments
PDSP_8
Citation
 Haviv, FFitzpatrick, TDSwenson, RENichols, CJMort, NABush, ENDiaz, GBammert, GNguyen, ARhutasel, NS Effect of N-methyl substitution of the peptide bonds in luteinizing hormone-releasing hormone agonists. J Med Chem 36:363-9 (1993)  
Target
Name:
Progonadoliberin-1
Synonyms:
GON1_RAT Gnrh1 Progonadoliberin-1
Type:
Enzyme Catalytic Domain
Mol. Mass.:
10497.39
Organism:
RAT
Description:
Luteinizing Hormone-Releasing Hormone LHRH 0 RAT::P07490
Residue:
92
  
Inhibitor
Name:
BDBM84716
Synonyms:
leuprolide 8NMeArg
Type:
Small organic molecule
Emp. Form.:
C60H86N16O12
Mol. Mass.:
1223.4248
SMILES:
CCNC(=O)[C@@H]1CCCN1C(=O)[C@H](CCCN=C(N)N)N(C)C(=O)[C@H](CC(C)C)NC(=O)[C@@H](CC(C)C)NC(=O)[C@H](Cc1ccc(O)cc1)NC(=O)[C@H](CO)NC(=O)[C@H](Cc1c[nH]c2ccccc12)NC(=O)[C@H](Cc1cnc[nH]1)NC(=O)[C@@H]1CCC(=O)N1
: